Target
D(2) dopamine receptor
Ligand
BDBM50092169
Substrate
Meas. Tech.
ChEMBL_61788 (CHEMBL670542)
EC50
19±n/a nM
Citation
 van Vliet, LARodenhuis, NWikström, HPugsley, TASerpa, KAMeltzer, LTHeffner, TGWise, LDLajiness, MEHuff, RMSvensson, KHaenen, GRBast, A Thiazoloindans and thiazolobenzopyrans: a novel class of orally active central dopamine (partial) agonists. J Med Chem 43:3549-57 (2000)  
Target
Name:
D(2) dopamine receptor
Synonyms:
DOPAMINE D2 DOPAMINE D2 Short Dopamine D2 receptor Drd2
Type:
G Protein-Coupled Receptor (GPCR)
Mol. Mass.:
50931.60
Organism:
Rattus norvegicus (rat)
Description:
P61169
Residue:
444
  
Inhibitor
Name:
BDBM50092169
Synonyms:
CHEMBL118636 | N*7*,N*7*-Dipropyl-7,8-dihydro-6H-1-thia-3-aza-as-indacene-2,7-diamine
Type:
Small organic molecule
Emp. Form.:
C16H23N3S
Mol. Mass.:
289.439
SMILES:
CCCN(CCC)C1Cc2ccc3nc(N)sc3c2C1
: