Target
Delta-type opioid receptor
Ligand
BDBM50084276
Substrate
Meas. Tech.
ChEMBL_145313 (CHEMBL751919)
EC50
6.1±n/a nM
Citation
 Husbands, SMLewis, JW Structural determinants of efficacy for kappa opioid receptors in the orvinol series: 7,7-spiro analogues of buprenorphine. J Med Chem 43:139-41 (2000)  
Target
Name:
Delta-type opioid receptor
Synonyms:
D-OR-1 Delta opioid receptor OPIATE Delta OPRD1 OPRK1 | opioid receptor, delta 1
Type:
G Protein-Coupled Receptor (GPCR)
Mol. Mass.:
40382.98
Organism:
Homo sapiens (Human)
Description:
Competition binding assays were carried out using membrane preparations from transfected HN9.10 cells that constitutively expressed the delta opioid receptor.
Residue:
372
  
Inhibitor
Name:
BDBM50084276
Synonyms:
7,7-Spiro analogue ofBuprinorphine | CHEMBL416765
Type:
Small organic molecule
Emp. Form.:
C24H29NO4
Mol. Mass.:
395.4914
SMILES:
CO[C@]12C=CC3(CC11CCC[C@H]1O)C1Cc4ccc(O)c5O[C@H]2C3(CCN1C)c45
: