Target
Kappa-type opioid receptor
Ligand
BDBM50084278
Substrate
Meas. Tech.
ChEMBL_145254 (CHEMBL751032)
Ki
1±n/a nM
Citation
 Husbands, SMLewis, JW Structural determinants of efficacy for kappa opioid receptors in the orvinol series: 7,7-spiro analogues of buprenorphine. J Med Chem 43:139-41 (2000)  
Target
Name:
Kappa-type opioid receptor
Synonyms:
K-OR-1 Kappa-opioid receptor (KOR) Kappa-type opioid receptor (KOR) OPIATE Kappa OPRK1 kappa opioid receptor (KOR)
Type:
G Protein-Coupled Receptor (GPCR)
Mol. Mass.:
42648.76
Organism:
Homo sapiens (Human)
Description:
P41145
Residue:
380
  
Inhibitor
Name:
BDBM50084278
Synonyms:
7,7-Spiro analogue ofBuprinorphine | CHEMBL281986
Type:
Small organic molecule
Emp. Form.:
C27H33NO4
Mol. Mass.:
435.5552
SMILES:
CO[C@]12C=CC3(CC11CCC[C@H]1O)C1Cc4ccc(O)c5O[C@H]2C3(CCN1CC1CC1)c45
: