Target
Neprilysin
Ligand
BDBM21641
Substrate
Meas. Tech.
ChEMBL_140876 (CHEMBL752507)
IC50
4.8±n/a nM
Citation
 De Lombaert, SBlanchard, LStamford, LBTan, JWallace, EMSatoh, YFitt, JHoyer, DSimonsbergen, DMoliterni, JMarcopoulos, NSavage, PChou, MTrapani, AJJeng, AY Potent and selective non-peptidic inhibitors of endothelin-converting enzyme-1 with sustained duration of action. J Med Chem 43:488-504 (2000)  
Target
Name:
Neprilysin
Synonyms:
Mme Neprilysin Neutral endopeptidase 24.11
Type:
Protein
Mol. Mass.:
85789.59
Organism:
Rattus norvegicus (Rat)
Description:
P07861
Residue:
750
  
Inhibitor
Name:
BDBM21641
Synonyms:
2-(2-benzyl-3-sulfanylpropanamido)acetic acid Thiorphan
Type:
Small organic molecule
Emp. Form.:
C12H15NO3S
Mol. Mass.:
253.317
SMILES:
OC(=O)CNC(=O)C(CS)Cc1ccccc1
: