Target
Kappa-type opioid receptor
Ligand
BDBM50087016
Substrate
Meas. Tech.
ChEMBL_145260 (CHEMBL751038)
Ki
26±n/a nM
Citation
 Röver, SAdam, GCesura, AMGalley, GJenck, FMonsma, FJWichmann, JDautzenberg, FM High-affinity, non-peptide agonists for the ORL1 (orphanin FQ/nociceptin) receptor. J Med Chem 43:1329-38 (2001)  
Target
Name:
Kappa-type opioid receptor
Synonyms:
K-OR-1 Kappa-opioid receptor (KOR) Kappa-type opioid receptor (KOR) OPIATE Kappa OPRK1 kappa opioid receptor (KOR)
Type:
G Protein-Coupled Receptor (GPCR)
Mol. Mass.:
42648.76
Organism:
Homo sapiens (Human)
Description:
P41145
Residue:
380
  
Inhibitor
Name:
BDBM50087016
Synonyms:
8-Acenaphthen-1-yl-1-phenyl-1,3,8-triaza-spiro[4.5]decan-4-one Ro65-6570
Type:
Small organic molecule
Emp. Form.:
C25H25N3O
Mol. Mass.:
383.4855
SMILES:
O=C1NCN(c2ccccc2)C11CCN(CC1)C1Cc2cccc3cccc1c23
: