Target
Tyrosine-protein kinase Lck
Ligand
BDBM50369833
Substrate
Meas. Tech.
ChEMBL_221650 (CHEMBL823227)
Kd
50000±n/a nM
Citation
 Proudfoot, JRBetageri, RCardozo, MGilmore, TAGlynn, SHickey, ERJakes, SKabcenell, AKirrane, TMTibolla, AKLukas, SPatel, URSharma, RYazdanian, MMoss, NBeaulieu, PLCameron, DRFerland, JMGauthier, JGillard, JGorys, VPoirier, MRancourt, JWernic, DLlinas-Brunet, M Nonpeptidic, monocharged, cell permeable ligands for the p56lck SH2 domain. J Med Chem 44:2421-31 (2001)  
Target
Name:
Tyrosine-protein kinase Lck
Synonyms:
2.7.10.2 LCK_HUMAN Leukocyte C-terminal Src kinase Lymphocyte-specific protein tyrosine kinase Protein YT16 Proto-oncogene tyrosine-protein kinase LCK T cell-specific protein-tyrosine kinase
Type:
Mol. Mass.:
57987.83
Organism:
Homo sapiens (Human)
Description:
P06239
Residue:
509
  
Inhibitor
Name:
BDBM50369833
Synonyms:
CHEMBL1907668
Type:
Small organic molecule
Emp. Form.:
C41H43N3O6
Mol. Mass.:
673.7966
SMILES:
COc1ccc(Cn2ccc(C)c(NC(=O)[C@@H](Cc3ccc(cc3)C(C)(C)C(O)=O)NC(=O)C(C)(C)c3ccc4ccccc4c3)c2=O)cc1
: