Target
Interstitial collagenase
Ligand
BDBM50076995
Substrate
Meas. Tech.
ChEMBL_106154 (CHEMBL718850)
Ki
<1±n/a nM
Citation
 Xue, CBVoss, MENelson, DJDuan, JJCherney, RJJacobson, ICHe, XRoderick, JChen, LCorbett, RLWang, LMeyer, DTKennedy, KDeGradodagger, WFHardman, KDTeleha, CAJaffee, BDLiu, RQCopeland, RACovington, MBChrist, DDTrzaskos, JMNewton, RCMagolda, RLWexler, RRDecicco, CP Design, synthesis, and structure-activity relationships of macrocyclic hydroxamic acids that inhibit tumor necrosis factor alpha release in vitro and in vivo. J Med Chem 44:2636-60 (2001)  
Target
Name:
Interstitial collagenase
Synonyms:
CLG MMP1 Matrix metalloproteinase-1 | Matrix metalloproteinase-1 (MMP-1)
Type:
Enzyme
Mol. Mass.:
54010.26
Organism:
Homo sapiens (Human)
Description:
P03956
Residue:
469
  
Inhibitor
Name:
BDBM50076995
Synonyms:
(6S,9R,10S)-10-Hydroxycarbamoyl-9-isobutyl-6-methylcarbamoyl-8-oxo-1,7diaza-cyclotridecane-1-carboxylic acid tert-butyl ester CHEMBL23725
Type:
Small organic molecule
Emp. Form.:
C23H42N4O6
Mol. Mass.:
470.6028
SMILES:
CNC(=O)[C@@H]1CCCCN(CCC[C@@H]([C@@H](CC(C)C)C(=O)N1)C(=O)NO)C(=O)OC(C)(C)C
: