Target
Interstitial collagenase
Ligand
BDBM50102658
Substrate
Meas. Tech.
ChEMBL_106154 (CHEMBL718850)
Ki
1.8±n/a nM
Citation
 Xue, CBVoss, MENelson, DJDuan, JJCherney, RJJacobson, ICHe, XRoderick, JChen, LCorbett, RLWang, LMeyer, DTKennedy, KDeGradodagger, WFHardman, KDTeleha, CAJaffee, BDLiu, RQCopeland, RACovington, MBChrist, DDTrzaskos, JMNewton, RCMagolda, RLWexler, RRDecicco, CP Design, synthesis, and structure-activity relationships of macrocyclic hydroxamic acids that inhibit tumor necrosis factor alpha release in vitro and in vivo. J Med Chem 44:2636-60 (2001)  
Target
Name:
Interstitial collagenase
Synonyms:
CLG MMP1 Matrix metalloproteinase-1 | Matrix metalloproteinase-1 (MMP-1)
Type:
Enzyme
Mol. Mass.:
54010.26
Organism:
Homo sapiens (Human)
Description:
P03956
Residue:
469
  
Inhibitor
Name:
BDBM50102658
Synonyms:
7-Isobutyl-8-oxo-2-oxa-9-aza-bicyclo[12.2.2]octadeca-1(17),14(18),15-triene-6,10-dicarboxylic acid 6-hydroxyamide 10-methylamide | CHEMBL328090
Type:
Small organic molecule
Emp. Form.:
C23H35N3O5
Mol. Mass.:
433.5411
SMILES:
CNC(=O)[C@@H]1CCCc2ccc(OCCC[C@@H]([C@@H](CC(C)C)C(=O)N1)C(=O)NO)cc2
: