Target
Reverse transcriptase/RNaseH
Ligand
BDBM1434
Substrate
Meas. Tech.
ChEMBL_196186 (CHEMBL801173)
Ki
9000±n/a nM
Citation
 Campiani, GAiello, FFabbrini, MMorelli, ERamunno, AArmaroli, SNacci, VGarofalo, AGreco, GNovellino, EMaga, GSpadari, SBergamini, AVentura, LBongiovanni, BCapozzi, MBolacchi, FMarini, SColetta, MGuiso, GCaccia, S Quinoxalinylethylpyridylthioureas (QXPTs) as potent non-nucleoside HIV-1 reverse transcriptase (RT) inhibitors. Further SAR studies and identification of a novel orally bioavailable hydrazine-based antiviral agent. J Med Chem 44:305-15 (2001)  
Target
Name:
Reverse transcriptase/RNaseH
Synonyms:
HIV-1 Reverse Transcriptase RNase H Reverse transcriptase/RNaseH
Type:
PROTEIN
Mol. Mass.:
65229.15
Organism:
Human immunodeficiency virus 1
Description:
ChEMBL_1473730
Residue:
566
  
Inhibitor
Name:
BDBM1434
Synonyms:
11-cyclopropyl-5,11-dihydro-4-methyl-6H-dipyrido[3,2-b:2 ,3 -e][1,4]diazepin-6-one BI-RG-587 Nevirapine US11420959, Example NVP | Viramune
Type:
Small organic molecule
Emp. Form.:
C15H14N4O
Mol. Mass.:
266.2979
SMILES:
Cc1ccnc2N(C3CC3)c3ncccc3C(=O)Nc12
: