Target
Adenosine receptor A1
Ligand
BDBM21173
Substrate
Meas. Tech.
ChEMBL_29123 (CHEMBL642257)
Ki
0.5±n/a nM
Citation
 Da Settimo, FPrimofiore, GTaliani, SMarini, AMLa Motta, CNovellino, EGreco, GLavecchia, ATrincavelli, LMartini, C 3-Aryl[1,2,4]triazino[4,3-a]benzimidazol-4(10H)-ones: a new class of selective A1 adenosine receptor antagonists. J Med Chem 44:316-27 (2001)  
Target
Name:
Adenosine receptor A1
Synonyms:
AA1R_BOVIN ADENOSINE A1 high ADORA1 | Adenosine A1 receptor
Type:
Enzyme Catalytic Domain
Mol. Mass.:
36602.99
Organism:
BOVINE
Description:
ADENOSINE 0 BOVINE::P28190
Residue:
326
  
Inhibitor
Name:
BDBM21173
Synonyms:
1,3-dipropyl-8-cyclopentylxanthine CHEMBL183 PD116948 | [3H]DPCPX
Type:
radiolabeled ligand
Emp. Form.:
C16H24N4O2
Mol. Mass.:
304.3874
SMILES:
CCCn1c2nc([nH]c2c(=O)n(CCC)c1=O)C1CCCC1
: