Target
D(4) dopamine receptor
Ligand
BDBM35255
Substrate
Meas. Tech.
ChEMBL_60684 (CHEMBL675946)
Ki
39±n/a nM
Citation
 Rowley, MBristow, LJHutson, PH Current and novel approaches to the drug treatment of schizophrenia. J Med Chem 44:477-501 (2001)  
Target
Name:
D(4) dopamine receptor
Synonyms:
D(2C) dopamine receptor DOPAMINE D4.2 DRD4 Dopamine D4 receptor
Type:
Enzyme
Mol. Mass.:
48373.19
Organism:
Homo sapiens (Human)
Description:
P21917
Residue:
419
  
Inhibitor
Name:
BDBM35255
Synonyms:
2-Chlor-11-(2-dimethylaminoaethoxy)-dibenzo(b,f)-thiepin 2-[(8-chlorodibenzo[b,f]thiepin-10-yl)oxy]-N,N-dimethylethanamine Nipolept zotepine
Type:
Small organic molecule
Emp. Form.:
C18H18ClNOS
Mol. Mass.:
331.86
SMILES:
CN(C)CCOC1=Cc2ccccc2Sc2ccc(Cl)cc12
: