Target
Neutrophil elastase
Ligand
BDBM50098826
Substrate
Meas. Tech.
ChEMBL_63965 (CHEMBL677434)
Ki
8.75±n/a nM
Citation
 Ohmoto, KYamamoto, TOkuma, MHoriuchi, TImanishi, HOdagaki, YKawabata, KSekioka, THirota, YMatsuoka, SNakai, HToda, MCheronis, JCSpruce, LWGyorkos, AWieczorek, M Development of orally active nonpeptidic inhibitors of human neutrophil elastase. J Med Chem 44:1268-85 (2001)  
Target
Name:
Neutrophil elastase
Synonyms:
Bone marrow serine protease Coagulation factor X ELANE Elastase HLE Leukocyte elastase Medullasin Neutrophil elastase (HNE) PMN elastase Trypsin
Type:
Enzyme
Mol. Mass.:
28532.38
Organism:
Homo sapiens (Human)
Description:
P08246
Residue:
267
  
Inhibitor
Name:
BDBM50098826
Synonyms:
2-(5-Amino-6-oxo-2-phenyl-6H-pyrimidin-1-yl)-N-{2-methyl-1-[5-(1-methyl-cyclopropyl)-[1,3,4]oxadiazole-2-carbonyl]-propyl}-acetamide | CHEMBL279296
Type:
Small organic molecule
Emp. Form.:
C23H26N6O4
Mol. Mass.:
450.4903
SMILES:
CC(C)[C@H](NC(=O)Cn1c(ncc(N)c1=O)-c1ccccc1)C(=O)c1nnc(o1)C1(C)CC1
: