Target
Oxytocin receptor
Ligand
BDBM50370112
Substrate
Meas. Tech.
ChEMBL_149044 (CHEMBL762237)
Ki
0.32±n/a nM
Citation
 Terrillon, SCheng, LLStoev, SMouillac, BBarberis, CManning, MDurroux, T Synthesis and characterization of fluorescent antagonists and agonists for human oxytocin and vasopressin V(1)(a) receptors. J Med Chem 45:2579-88 (2002)  
Target
Name:
Oxytocin receptor
Synonyms:
OT-R OXYR_HUMAN | Oxytocin
Type:
Enzyme Catalytic Domain
Mol. Mass.:
42793.26
Organism:
Homo sapiens (Human)
Description:
Oxytocin OXTR HEK293::B2R9L7
Residue:
389
  
Inhibitor
Name:
BDBM50370112
Synonyms:
CHEMBL1790729
Type:
Small organic molecule
Emp. Form.:
C61H73N11O18S2
Mol. Mass.:
1312.425
SMILES:
CC[C@@H](C)[C@H]1NC(=O)[C@@H](NC(=O)C(O)CSSC[C@@H](NC(=O)[C@@H](CC(N)=O)NC(=O)[C@H](NC1=O)C(C)O)C(=O)N1CCC[C@@H]1C(=O)N[C@@H](CCCCNC(=O)c1ccc2C(=O)OC3(c2c1)c1ccc(O)cc1Oc1cc(O)ccc31)C(=O)NCN)c1ccc(O)cc1
: