Target
Melanocortin receptor 5
Ligand
BDBM50114078
Substrate
Meas. Tech.
ChEMBL_106653 (CHEMBL712998)
Ki
26±n/a nM
Citation
 Kavarana, MJTrivedi, DCai, MYing, JHammer, MCabello, CGrieco, PHan, GHruby, VJ Novel cyclic templates of alpha-MSH give highly selective and potent antagonists/agonists for human melanocortin-3/4 receptors. J Med Chem 45:2644-50 (2002)  
Target
Name:
Melanocortin receptor 5
Synonyms:
MC-2 MC5R Melanocortin MC5 Melanocortin receptor 5 | Melanocortin receptor 5 (MC5R)
Type:
Enzyme
Mol. Mass.:
36612.92
Organism:
Homo sapiens (Human)
Description:
P33032
Residue:
325
  
Inhibitor
Name:
BDBM50114078
Synonyms:
8-(3-Guanidino-propyl)-2-(3H-imidazol-4-ylmethyl)-11-(1H-indol-3-ylmethyl)-5-naphthalen-2-ylmethyl-3,6,9,12,20,24-hexaoxo-1,4,7,10,13,19hexaaza-cyclotetracosane-14-carboxylic acid amide | CHEMBL313279
Type:
Small organic molecule
Emp. Form.:
C47H59N13O7
Mol. Mass.:
918.0543
SMILES:
NC(=N)NCCC[C@@H]1NC(=O)[C@@H](Cc2ccc3ccccc3c2)NC(=O)[C@H](Cc2cnc[nH]2)NC(=O)CCCC(=O)NCCCC[C@@H](NC(=O)[C@@H](Cc2c[nH]c3ccccc23)NC1=O)C(N)=O
: