Target
Melanocortin receptor 5
Ligand
BDBM50115366
Substrate
Meas. Tech.
ChEMBL_104264 (CHEMBL711701)
EC50
631±n/a nM
Citation
 Holder, JRBauzo, RMXiang, ZHaskell-Luevano, C Structure-activity relationships of the melanocortin tetrapeptide Ac-His-DPhe-Arg-Trp-NH(2) at the mouse melanocortin receptors: part 2 modifications at the Phe position. J Med Chem 45:3073-81 (2002)  
Target
Name:
Melanocortin receptor 5
Synonyms:
MC5R_MOUSE Melanocortin receptor 5 | Melanocortin receptor 5 (MC5R)
Type:
Enzyme
Mol. Mass.:
36966.58
Organism:
Mus musculus (Mouse)
Description:
P41149
Residue:
325
  
Inhibitor
Name:
BDBM50115366
Synonyms:
2-[2-[2-Acetylamino-3-(3H-imidazol-4-yl)-propionylamino]-3-(4-hydroxy-phenyl)-propionylamino]-5-guanidino-pentanoic acid [1-carbamoyl-2-(1H-indol-3-yl)-ethyl]-amide CHEMBL105113
Type:
Small organic molecule
Emp. Form.:
C34H43N11O6
Mol. Mass.:
701.7753
SMILES:
CC(=O)N[C@@H](Cc1cnc[nH]1)C(=O)N[C@H](Cc1ccc(O)cc1)C(=O)N[C@@H](CCCN=C(N)N)C(=O)N[C@@H](Cc1c[nH]c2ccccc12)C(N)=O
: