Target
11-beta-hydroxysteroid dehydrogenase 1
Ligand
BDBM50247012
Substrate
Meas. Tech.
ChEMBL_190 (CHEMBL615226)
IC50
83±n/a nM
Citation
 Barf, TVallgårda, JEmond, RHäggström, CKurz, GNygren, ALarwood, VMosialou, EAxelsson, KOlsson, REngblom, LEdling, NRönquist-Nii, YOhman, BAlberts, PAbrahmsén, L Arylsulfonamidothiazoles as a new class of potential antidiabetic drugs. Discovery of potent and selective inhibitors of the 11beta-hydroxysteroid dehydrogenase type 1. J Med Chem 45:3813-5 (2002)  
Target
Name:
11-beta-hydroxysteroid dehydrogenase 1
Synonyms:
11-DH 11-beta-Hydroxysteroid Dehydrogenase 1 (11-beta-HSD1) 11-beta-hydroxysteroid dehydrogenase 1 (11HSD1) Corticosteroid 11-beta-dehydrogenase isozyme 1 (11-beta-HSD-1) Corticosteroid 11-beta-dehydrogenase isozyme 1 (11beta-HSD1) HSD11 HSD11L | SDR26C1
Type:
Enzyme
Mol. Mass.:
32409.16
Organism:
Homo sapiens (Human)
Description:
P28845
Residue:
292
  
Inhibitor
Name:
BDBM50247012
Synonyms:
3beta-O-Succinyl-18-beta-glycyrrhetinic acid US11660306, Example Carbeanoxolone
Type:
Small organic molecule
Emp. Form.:
C34H50O7
Mol. Mass.:
570.7566
SMILES:
CC1(C)[C@H](CC[C@@]2(C)[C@H]1CC[C@]1(C)[C@@H]2C(=O)C=C2[C@@H]3C[C@](C)(CC[C@]3(C)CC[C@@]12C)C(O)=O)OC(=O)CCC(O)=O
: