Target
P2X purinoceptor 3
Ligand
BDBM50118232
Substrate
Meas. Tech.
ChEMBL_147403 (CHEMBL884064)
EC50
350±n/a nM
Citation
 Jacobson, KAJarvis, MFWilliams, M Purine and pyrimidine (P2) receptors as drug targets. J Med Chem 45:4057-93 (2002)  
Target
Name:
P2X purinoceptor 3
Synonyms:
ATP receptor P2RX3 P2X purinoceptor 3 P2X purinoceptor 3 (P2X3) P2X3 purinoceptor p2x3 + hsa
Type:
Protein
Mol. Mass.:
44292.02
Organism:
Homo sapiens (Human)
Description:
P56373
Residue:
397
  
Inhibitor
Name:
BDBM50118232
Synonyms:
2-MeSATP CHEMBL336208
Type:
Small organic molecule
Emp. Form.:
C11H18N5O13P3S
Mol. Mass.:
553.273
SMILES:
CSc1nc(N)c2ncn([C@@H]3O[C@H](COP(O)(=O)OP(O)(=O)OP(O)(O)=O)[C@@H](O)[C@H]3O)c2n1
: