Target
P2X purinoceptor 6
Ligand
BDBM50118232
Substrate
Meas. Tech.
ChEMBL_147419 (CHEMBL750993)
EC50
600±n/a nM
Citation
 Jacobson, KAJarvis, MFWilliams, M Purine and pyrimidine (P2) receptors as drug targets. J Med Chem 45:4057-93 (2002)  
Target
Name:
P2X purinoceptor 6
Synonyms:
ATP receptor P2X6 P2rx6 Purinergic receptor | Purinergic receptor P2X-like 1
Type:
PROTEIN
Mol. Mass.:
42451.11
Organism:
Rattus norvegicus
Description:
ChEMBL_147419
Residue:
379
  
Inhibitor
Name:
BDBM50118232
Synonyms:
2-MeSATP CHEMBL336208
Type:
Small organic molecule
Emp. Form.:
C11H18N5O13P3S
Mol. Mass.:
553.273
SMILES:
CSc1nc(N)c2ncn([C@@H]3O[C@H](COP(O)(=O)OP(O)(=O)OP(O)(O)=O)[C@@H](O)[C@H]3O)c2n1
: