Target
Thymidine kinase, cytosolic
Ligand
BDBM1
Substrate
Meas. Tech.
ChEMBL_208017 (CHEMBL814146)
IC50
26±n/a nM
Citation
 Hernández, AIBalzarini, JKarlsson, ACamarasa, MJPérez-Pérez, MJ Acyclic nucleoside analogues as novel inhibitors of human mitochondrial thymidine kinase. J Med Chem 45:4254-63 (2002)  
Target
Name:
Thymidine kinase, cytosolic
Synonyms:
KITH_HUMAN | TK1
Type:
PROTEIN
Mol. Mass.:
25476.50
Organism:
Homo sapiens (Human)
Description:
ChEMBL_1333884
Residue:
234
  
Inhibitor
Name:
BDBM1
Synonyms:
dT | thymidine
Type:
Nucleoside or nucleotide
Emp. Form.:
C10H14N2O5
Mol. Mass.:
242.2286
SMILES:
Cc1cn([C@H]2C[C@H](O)[C@@H](CO)O2)c(=O)[nH]c1=O
: