Target
Mu-type opioid receptor
Ligand
BDBM50059841
Substrate
Meas. Tech.
ChEMBL_148993 (CHEMBL757977)
Ki
1.22±n/a nM
Citation
 Balboni, GSalvadori, SGuerrini, RNegri, LGiannini, EJinsmaa, YBryant, SDLazarus, LH Potent delta-opioid receptor agonists containing the Dmt-Tic pharmacophore. J Med Chem 45:5556-63 (2002)  
Target
Name:
Mu-type opioid receptor
Synonyms:
MOR-1 Mu-type opioid receptor (MOR) OPRM_RAT Opioid receptor B Ror-b
Type:
G Protein-Coupled Receptor (GPCR)
Mol. Mass.:
44503.11
Organism:
Rattus norvegicus (rat)
Description:
Competition binding assays were carried out using membrane preparations from transfected HN9.10 cells that constitutively expressed the mu opioid receptor.
Residue:
398
  
Inhibitor
Name:
BDBM50059841
Synonyms:
(S)-1-[(S)-2-[2-((S)-2-{(R)-2-[(S)-2-Amino-3-(4-hydroxy-phenyl)-propionylamino]-propionylamino}-3-phenyl-propionylamino)-acetylamino]-3-(4-hydroxy-phenyl)-propionyl]-pyrrolidine-2-carboxylic acid ((S)-1-carbamoyl-2-hydroxy-ethyl)-amide 1-[2-[2-(2-{2-[2-Amino-3-(4-hydroxy-phenyl)-propionylamino]-propionylamino}-3-phenyl-propionylamino)-acetylamino]-3-(4-hydroxy-phenyl)-propionyl]-pyrrolidine-2-carboxylic acid (1-carbamoyl-2-hydroxy-ethyl)-amide 1-[2-[2-(2-{2-[2-Amino-3-(4-hydroxy-phenyl)-propionylamino]-propionylamino}-3-phenyl-propionylamino)-acetylamino]-3-(4-hydroxy-phenyl)-propionyl]-pyrrolidine-2-carboxylic acid (1-carbamoyl-2-hydroxy-ethyl)-amide(Dermorphin) DERMORPHIN H-Tyr-D-Ala-Phe-Gly-Tyr-Pro-Ser-NH2 YAFGYPS-NH2
Type:
Small organic molecule
Emp. Form.:
C40H50N8O10
Mol. Mass.:
802.8726
SMILES:
C[C@@H](NC(=O)[C@@H](N)Cc1ccc(O)cc1)C(=O)N[C@@H](Cc1ccccc1)C(=O)NCC(=O)N[C@@H](Cc1ccc(O)cc1)C(=O)N1CCC[C@H]1C(=O)N[C@@H](CO)C(N)=O
: