Target
Mu-type opioid receptor
Ligand
BDBM50121645
Substrate
Meas. Tech.
ChEMBL_148993 (CHEMBL757977)
Ki
0.233±n/a nM
Citation
 Balboni, GSalvadori, SGuerrini, RNegri, LGiannini, EJinsmaa, YBryant, SDLazarus, LH Potent delta-opioid receptor agonists containing the Dmt-Tic pharmacophore. J Med Chem 45:5556-63 (2002)  
Target
Name:
Mu-type opioid receptor
Synonyms:
MOR-1 Mu-type opioid receptor (MOR) OPRM_RAT Opioid receptor B Ror-b
Type:
G Protein-Coupled Receptor (GPCR)
Mol. Mass.:
44503.11
Organism:
Rattus norvegicus (rat)
Description:
Competition binding assays were carried out using membrane preparations from transfected HN9.10 cells that constitutively expressed the mu opioid receptor.
Residue:
398
  
Inhibitor
Name:
BDBM50121645
Synonyms:
2-[(2S)-2-amino-3-(4-hydroxy-2,6-dimethylphenyl)propanoyl]-N-[(1S)-1-(1H-1,3-benzodiazol-2-yl)ethyl]-1,2,3,4-tetrahydroisoquinoline-3-carboxamide | 2-[2-Amino-3-(4-hydroxy-2,6-dimethyl-phenyl)-propionyl]-1,2,3,4-tetrahydro-isoquinoline-3-carboxylic acid [1-(1H-benzoimidazol-2-yl)-ethyl]-amide
Type:
Small organic molecule
Emp. Form.:
C30H33N5O3
Mol. Mass.:
511.6147
SMILES:
C[C@H](NC(=O)C1Cc2ccccc2CN1C(=O)[C@@H](N)Cc1c(C)cc(O)cc1C)c1nc2ccccc2[nH]1
: