Target
Delta-type opioid receptor
Ligand
BDBM50009145
Substrate
Meas. Tech.
ChEMBL_147039 (CHEMBL753342)
Ki
0.24±n/a nM
Citation
 Balboni, GSalvadori, SGuerrini, RNegri, LGiannini, EJinsmaa, YBryant, SDLazarus, LH Potent delta-opioid receptor agonists containing the Dmt-Tic pharmacophore. J Med Chem 45:5556-63 (2002)  
Target
Name:
Delta-type opioid receptor
Synonyms:
Cytochrome P450 3A4 Delta opioid receptor Delta-type opioid receptor (DOR) OPRD_RAT Opioid receptor Opioid receptors; mu & delta Ror-a | Voltage-gated potassium channel
Type:
G Protein-Coupled Receptor (GPCR)
Mol. Mass.:
40465.04
Organism:
Rattus norvegicus (rat)
Description:
Competition binding assays were using CHO-K1 cell membranes expressing the opioid receptor.
Residue:
372
  
Inhibitor
Name:
BDBM50009145
Synonyms:
3-(2-{2-[2-Amino-3-(4-hydroxy-phenyl)-propionylamino]-propionylamino}-3-phenyl-propionylamino)-N-{1-[1-(carboxymethyl-carbamoyl)-2-methyl-propylcarbamoyl]-2-methyl-propyl}-succinamic acid | CHEMBL26861
Type:
Small organic molecule
Emp. Form.:
C37H51N7O11
Mol. Mass.:
769.8411
SMILES:
CC(C)[C@H](NC(=O)[C@@H](NC(=O)[C@H](CC(O)=O)NC(=O)[C@H](Cc1ccccc1)NC(=O)[C@H](C)NC(=O)[C@@H](N)Cc1ccc(O)cc1)C(C)C)C(=O)NCC(O)=O
: