Target
Melanocyte-stimulating hormone receptor
Ligand
BDBM50122072
Substrate
Meas. Tech.
ChEMBL_106823 (CHEMBL717664)
EC50
2300±n/a nM
Citation
 Holder, JRXiang, ZBauzo, RMHaskell-Luevano, C Structure-activity relationships of the melanocortin tetrapeptide Ac-His-D-Phe-Arg-Trp-NH2 at the mouse melanocortin receptors. 4. Modifications at the Trp position. J Med Chem 45:5736-44 (2002)  
Target
Name:
Melanocyte-stimulating hormone receptor
Synonyms:
MC1-R Mc1r Melanocyte-stimulating hormone receptor | Msh-r
Type:
PROTEIN
Mol. Mass.:
35238.60
Organism:
Mus musculus
Description:
ChEMBL_1498846
Residue:
315
  
Inhibitor
Name:
BDBM50122072
Synonyms:
Ac-His-D-Phe-Arg-Dip-NH2 | CHEMBL152555
Type:
Small organic molecule
Emp. Form.:
C38H46N10O5
Mol. Mass.:
722.8358
SMILES:
CC(=O)N[C@@H](Cc1cnc[nH]1)C(=O)N[C@@H](Cc1ccccc1)C(=O)N[C@@H](CCCNC(N)=N)C(=O)N[C@H](C(c1ccccc1)c1ccccc1)C(N)=O
: