Target
Melanocortin receptor 5
Ligand
BDBM50122074
Substrate
Meas. Tech.
ChEMBL_104262 (CHEMBL711699)
EC50
47.7±n/a nM
Citation
 Holder, JRXiang, ZBauzo, RMHaskell-Luevano, C Structure-activity relationships of the melanocortin tetrapeptide Ac-His-D-Phe-Arg-Trp-NH2 at the mouse melanocortin receptors. 4. Modifications at the Trp position. J Med Chem 45:5736-44 (2002)  
Target
Name:
Melanocortin receptor 5
Synonyms:
MC5R_MOUSE Melanocortin receptor 5 | Melanocortin receptor 5 (MC5R)
Type:
Enzyme
Mol. Mass.:
36966.58
Organism:
Mus musculus (Mouse)
Description:
P41149
Residue:
325
  
Inhibitor
Name:
BDBM50122074
Synonyms:
Ac-His-D-Phe-Arg-3Bal-NH2 | CHEMBL151906
Type:
Small organic molecule
Emp. Form.:
C34H42N10O5S
Mol. Mass.:
702.826
SMILES:
CC(=O)N[C@@H](Cc1cnc[nH]1)C(=O)N[C@@H](Cc1ccccc1)C(=O)N[C@@H](CCCNC(N)=N)C(=O)N[C@H](Cc1csc2ccccc12)C(N)=O
: