Target
5-hydroxytryptamine receptor 6
Ligand
BDBM50130262
Substrate
Meas. Tech.
ChEMBL_3664 (CHEMBL620800)
Ki
>5000±n/a nM
Citation
 Glennon, RA Higher-end serotonin receptors: 5-HT(5), 5-HT(6), and 5-HT(7). J Med Chem 46:2795-812 (2003)  
Target
Name:
5-hydroxytryptamine receptor 6
Synonyms:
5-HT-6 5-hydroxytryptamine receptor 6 (5-HT-6) 5-hydroxytryptamine receptor 6 (5HT6) HTR6 Serotonin 6 (5-HT6) receptor | Serotonin Receptor 6
Type:
G Protein-Coupled Receptor (GPCR)
Mol. Mass.:
46968.43
Organism:
Homo sapiens (Human)
Description:
P50406
Residue:
440
  
Inhibitor
Name:
BDBM50130262
Synonyms:
2,3,4,9-Tetrahydro-1H-beta-carboline EN300-119677
Type:
Small organic molecule
Emp. Form.:
C11H12N2
Mol. Mass.:
172.2264
SMILES:
C1Cc2c(CN1)[nH]c1ccccc21
: