Target
Histamine H4 receptor
Ligand
BDBM22884
Substrate
Meas. Tech.
ChEMBL_87090 (CHEMBL700768)
Ki
12.3±n/a nM
Citation
 Jablonowski, JAGrice, CAChai, WDvorak, CAVenable, JDKwok, AKLy, KSWei, JBaker, SMDesai, PJJiang, WWilson, SJThurmond, RLKarlsson, LEdwards, JPLovenberg, TWCarruthers, NI The first potent and selective non-imidazole human histamine H4 receptor antagonists. J Med Chem 46:3957-60 (2003)  
Target
Name:
Histamine H4 receptor
Synonyms:
AXOR35 GPCR105 HH4R HRH4 Histamine H4 receptor Histamine receptor (H3 and H4) SP9144
Type:
G Protein-Coupled Receptor (GPCR)
Mol. Mass.:
44517.02
Organism:
Homo sapiens (Human)
Description:
Binding assays were using CHO cells stably expressing hH4R receptors.
Residue:
390
  
Inhibitor
Name:
BDBM22884
Synonyms:
2-[3-(1H-imidazol-5-yl)propyl]-1-(2-{[(5-methyl-1H-imidazol-4-yl)methyl]sulfanyl}ethyl)guanidine Impromidine
Type:
Small organic molecule
Emp. Form.:
C14H23N7S
Mol. Mass.:
321.444
SMILES:
Cc1nc[nH]c1CSCCN=C(N)NCCCc1cnc[nH]1
: