Target
D(3) dopamine receptor
Ligand
BDBM50133928
Substrate
Meas. Tech.
ChEMBL_62281 (CHEMBL675051)
Ki
83.50±n/a nM
Citation
 Varady, JWu, XFang, XMin, JHu, ZLevant, BWang, S Molecular modeling of the three-dimensional structure of dopamine 3 (D3) subtype receptor: discovery of novel and potent D3 ligands through a hybrid pharmacophore- and structure-based database searching approach. J Med Chem 46:4377-92 (2003)  
Target
Name:
D(3) dopamine receptor
Synonyms:
DOPAMINE D3 DRD3_HUMAN Dopamine D3 receptor (D3) Dopamine receptor Dopamine receptor D3
Type:
Mol. Mass.:
44243.43
Organism:
Homo sapiens (Human)
Description:
Residue:
400
  
Inhibitor
Name:
BDBM50133928
Synonyms:
1-(4-Fluoro-phenyl)-4-(1,2,4,4a,5,6-hexahydro-pyrazino[1,2-a]quinolin-3-yl)-butan-1-one | CHEMBL341774
Type:
Small organic molecule
Emp. Form.:
C22H25FN2O
Mol. Mass.:
352.4451
SMILES:
Fc1ccc(cc1)C(=O)CCCN1CCN2C(CCc3ccccc23)C1
: