Target
Acetylcholine receptor subunit alpha/beta/delta/gamma
Ligand
BDBM50125935
Substrate
Meas. Tech.
ChEMBL_144957 (CHEMBL755075)
IC50
50000±n/a nM
Citation
 Husain, SSZiebell, MRRuesch, DHong, FArevalo, EKosterlitz, JAOlsen, RWForman, SACohen, JBMiller, KW 2-(3-Methyl-3H-diaziren-3-yl)ethyl 1-(1-phenylethyl)-1H-imidazole-5-carboxylate: a derivative of the stereoselective general anesthetic etomidate for photolabeling ligand-gated ion channels. J Med Chem 46:1257-65 (2003)  
Target
Name:
Acetylcholine receptor subunit alpha/beta/delta/gamma
Synonyms:
Nicotinic acetylcholine receptor alpha1/beta1/gamma/delta
Type:
Mol. Mass.:
Description:
ASSAY_ID of ChEMBL is 144957
Components:
This complex has 4 components.
Component 1
Name:
Acetylcholine receptor subunit alpha
Synonyms:
ACHA_MOUSE Acra n-AChR
Type:
Enzyme Catalytic Domain
Mol. Mass.:
51932.98
Organism:
MOUSE
Description:
n-AChR 0 MOUSE::P04756
Residue:
457
  
Component 2
Name:
Acetylcholine receptor subunit beta
Synonyms:
ACHB_MOUSE Acrb | Chrnb1
Type:
PROTEIN
Mol. Mass.:
56919.84
Organism:
Mus musculus
Description:
EBI_11803
Residue:
501
  
Component 3
Name:
Acetylcholine receptor subunit gamma
Synonyms:
ACHG_MOUSE Acrg | Chrng
Type:
PROTEIN
Mol. Mass.:
58747.23
Organism:
Mus musculus
Description:
ChEMBL_107886
Residue:
519
  
Component 4
Name:
Acetylcholine receptor subunit delta
Synonyms:
ACHD_MOUSE Acrd | Chrnd
Type:
PROTEIN
Mol. Mass.:
59138.17
Organism:
Mus musculus
Description:
EBI_100149
Residue:
520
  
Inhibitor
Name:
BDBM50125935
Synonyms:
(R)-1-(1-phenylethyl)-1H-imidazole-5-carboxylic acid ethyl ester 3-((R)-1-Phenyl-ethyl)-3H-imidazole-4-carboxylic acid ethyl ester CHEMBL681 R(+)-etomidate | R-ETOMIDATE
Type:
Small organic molecule
Emp. Form.:
C14H16N2O2
Mol. Mass.:
244.289
SMILES:
CCOC(=O)c1cncn1[C@H](C)c1ccccc1
: