Target
Acetylcholine receptor subunit alpha/beta/delta/gamma
Ligand
BDBM50125935
Substrate
Meas. Tech.
ChEMBL_144959 (CHEMBL755077)
IC50
41000±n/a nM
Citation
 Husain, SSZiebell, MRRuesch, DHong, FArevalo, EKosterlitz, JAOlsen, RWForman, SACohen, JBMiller, KW 2-(3-Methyl-3H-diaziren-3-yl)ethyl 1-(1-phenylethyl)-1H-imidazole-5-carboxylate: a derivative of the stereoselective general anesthetic etomidate for photolabeling ligand-gated ion channels. J Med Chem 46:1257-65 (2003)  
Target
Name:
Acetylcholine receptor subunit alpha/beta/delta/gamma
Synonyms:
Acetylcholine receptor | Acetylcholine receptor protein alpha/beta/delta/gamma chain
Type:
Mol. Mass.:
Description:
ASSAY_ID of EBI is 143080
Components:
This complex has 4 components.
Component 1
Name:
Acetylcholine receptor subunit beta
Synonyms:
ACHB_TETCF CHRNB1
Type:
PROTEIN
Mol. Mass.:
56146.98
Organism:
Torpedo californica
Description:
EBI_19626
Residue:
493
  
Component 2
Name:
Acetylcholine receptor subunit gamma
Synonyms:
ACHG_TETCF CHRNG
Type:
PROTEIN
Mol. Mass.:
58151.68
Organism:
Torpedo californica
Description:
EBI_19662
Residue:
506
  
Component 3
Name:
Acetylcholine receptor subunit alpha
Synonyms:
ACHA_TETCF Acetylcholine receptor protein alpha chain | CHRNA1
Type:
PROTEIN
Mol. Mass.:
52735.09
Organism:
Torpedo californica
Description:
ChEMBL_216981
Residue:
461
  
Component 4
Name:
Acetylcholine receptor subunit delta
Synonyms:
ACHD_TETCF Acetylcholine receptor protein delta chain | chrnd
Type:
PROTEIN
Mol. Mass.:
59885.01
Organism:
Torpedo californica
Description:
ChEMBL_142744
Residue:
522
  
Inhibitor
Name:
BDBM50125935
Synonyms:
(R)-1-(1-phenylethyl)-1H-imidazole-5-carboxylic acid ethyl ester 3-((R)-1-Phenyl-ethyl)-3H-imidazole-4-carboxylic acid ethyl ester CHEMBL681 R(+)-etomidate | R-ETOMIDATE
Type:
Small organic molecule
Emp. Form.:
C14H16N2O2
Mol. Mass.:
244.289
SMILES:
CCOC(=O)c1cncn1[C@H](C)c1ccccc1
: