Target
Melanocortin receptor 4
Ligand
BDBM50144874
Substrate
Meas. Tech.
ChEMBL_106503 (CHEMBL713984)
IC50
4100±n/a nM
Citation
 Wilczynski, AWang, XSJoseph, CGXiang, ZBauzo, RMScott, JWSorensen, NBShaw, AMMillard, WJRichards, NGHaskell-Luevano, C Identification of putative agouti-related protein(87-132)-melanocortin-4 receptor interactions by homology molecular modeling and validation using chimeric peptide ligands. J Med Chem 47:2194-207 (2004)  
Target
Name:
Melanocortin receptor 4
Synonyms:
MC4-R Mc4r
Type:
PROTEIN
Mol. Mass.:
36964.43
Organism:
Mus musculus
Description:
ChEMBL_1498850
Residue:
332
  
Inhibitor
Name:
BDBM50144874
Synonyms:
CHEMBL440633 | Tyr-c[Asp-Phe-Arg-Trp-Asn-Ala-Phe-Dpr]-Tyr-NH2
Type:
Small organic molecule
Emp. Form.:
C68H80N18O17
Mol. Mass.:
1421.4732
SMILES:
C[C@H]1NC(=O)[C@H](CC(N)=O)NC(=O)[C@@H](Cc2c[nH]c3ccccc23)NC(=O)[C@H](CCCNC(N)=N)NC(=O)[C@@H](Cc2ccccc2)NC(=O)[C@@H](CC(=O)NC(NC(=O)C(=O)[C@H](Cc2ccccc2)NC1=O)C(=O)NN[C@H](Cc1ccc(O)cc1)C(=O)C(O)=O)NC(=O)[C@H](Cc1ccc(O)cc1)NN
: