Target
Translocator protein
Ligand
BDBM50122293
Substrate
Meas. Tech.
ChEMBL_154645 (CHEMBL760163)
Ki
0.16±n/a nM
Citation
 Zhang, MRMaeda, JOgawa, MNoguchi, JIto, TYoshida, YOkauchi, TObayashi, SSuhara, TSuzuki, K Development of a new radioligand, N-(5-fluoro-2-phenoxyphenyl)-N-(2-[18F]fluoroethyl-5-methoxybenzyl)acetamide, for pet imaging of peripheral benzodiazepine receptor in primate brain. J Med Chem 47:2228-35 (2004)  
Target
Name:
Translocator protein
Synonyms:
Benzodiazepine receptors; peripheral & central Mbr PBR Peripheral benzodiazepine receptor (PBR) TSPO_RAT | Tspo
Type:
Mitochondrion membrane protein
Mol. Mass.:
18945.84
Organism:
Rattus norvegicus (rat)
Description:
Competitive binding experiments were performed on rat kidney mitochondrial membranes.
Residue:
169
  
Inhibitor
Name:
BDBM50122293
Synonyms:
CHEMBL401000 N-(2,5-Dimethoxy-benzyl)-N-(5-fluoro-2-phenoxy-phenyl)-acetamide N-(2,5-dimethoxybenzyl)-N-(5-fluoro-2-phenoxyphenyl)acetamide
Type:
Small organic molecule
Emp. Form.:
C23H22FNO4
Mol. Mass.:
395.4235
SMILES:
COc1ccc(OC)c(CN(C(C)=O)c2cc(F)ccc2Oc2ccccc2)c1
: