Target
Prostaglandin F2-alpha receptor
Ligand
BDBM50150893
Substrate
Meas. Tech.
ChEMBL_310565 (CHEMBL834139)
EC50
781±n/a nM
Citation
 Selliah, RDHellberg, MRSharif, NAMcLaughlin, MAWilliams, GWScott, DAEarnest, DHaggard, KSDean, WDDelgado, PGaines, MSConrow, REKlimko, PG AL-12182, a novel 11-oxa prostaglandin analog with topical ocular hypotensive activity in the monkey. Bioorg Med Chem Lett 14:4525-8 (2004)  
Target
Name:
Prostaglandin F2-alpha receptor
Synonyms:
PF2R_HUMAN PGF2 alpha receptor PTGFR Prostanoid FP receptor
Type:
Enzyme
Mol. Mass.:
40072.29
Organism:
Homo sapiens (Human)
Description:
P43088
Residue:
359
  
Inhibitor
Name:
BDBM50150893
Synonyms:
(Z)-8-{(2R,3S,4R)-4-Hydroxy-2-[(E)-(S)-3-hydroxy-4-(3-trifluoromethyl-phenoxy)-but-1-enyl]-tetrahydro-furan-3-yl}-oct-4-enoic acid | CHEMBL363439
Type:
Small organic molecule
Emp. Form.:
C23H29F3O6
Mol. Mass.:
458.468
SMILES:
O[C@H](COc1cccc(c1)C(F)(F)F)\C=C\[C@H]1OC[C@H](O)[C@@H]1CCC\C=C/CCC(O)=O
: