Target
Carbonic anhydrase
Ligand
BDBM26989
Substrate
Meas. Tech.
ChEMBL_303052 (CHEMBL828021)
Ki
44800000±n/a nM
Citation
 Innocenti, AZimmerman, SFerry, JGScozzafava, ASupuran, CT Carbonic anhydrase inhibitors. Inhibition of the beta-class enzyme from the methanoarchaeon Methanobacterium thermoautotrophicum (Cab) with anions. Bioorg Med Chem Lett 14:4563-7 (2004)  
Target
Name:
Carbonic anhydrase
Synonyms:
Type:
PROTEIN
Mol. Mass.:
19556.84
Organism:
Methanobacterium thermoautotrophicum
Description:
ChEMBL_1280426
Residue:
176
  
Inhibitor
Name:
BDBM26989
Synonyms:
CHEMBL93268 nitrite | nitrite ion
Type:
Ion
Emp. Form.:
NO2
Mol. Mass.:
46.006
SMILES:
[O-]N=O
: