Target
Carbonic anhydrase
Ligand
BDBM26989
Substrate
Meas. Tech.
ChEMBL_302701 (CHEMBL876781)
Ki
6800000±n/a nM
Citation
 Innocenti, AZimmerman, SFerry, JGScozzafava, ASupuran, CT Carbonic anhydrase inhibitors. Inhibition of the beta-class enzyme from the methanoarchaeon Methanobacterium thermoautotrophicum (Cab) with anions. Bioorg Med Chem Lett 14:4563-7 (2004)  
Target
Name:
Carbonic anhydrase
Synonyms:
CAH_METTT Carbonic anhydrase | Gamma-carbonic anhydrase
Type:
Protein
Mol. Mass.:
26390.56
Organism:
Methanosarcina thermophila
Description:
P40881
Residue:
247
  
Inhibitor
Name:
BDBM26989
Synonyms:
CHEMBL93268 nitrite | nitrite ion
Type:
Ion
Emp. Form.:
NO2
Mol. Mass.:
46.006
SMILES:
[O-]N=O
: