Target
Potassium voltage-gated channel subfamily H member 2
Ligand
BDBM50151863
Substrate
Meas. Tech.
ChEMBL_304914 (CHEMBL827807)
IC50
90±n/a nM
Citation
 Du, LPTsai, KCLi, MYYou, QDXia, L The pharmacophore hypotheses of I(Kr) potassium channel blockers: novel class III antiarrhythmic agents. Bioorg Med Chem Lett 14:4771-7 (2004)  
Target
Name:
Potassium voltage-gated channel subfamily H member 2
Synonyms:
1,3-beta-glucan synthase component GLS2 ERG Eag-related protein 1 Ether-a-go-go-related gene (HERG) Ether-a-go-go-related gene potassium channel 1 Ether-a-go-go-related gene potassium channel 1 (hERG1) Ether-a-go-go-related protein 1 H-ERG KCNH2 Potassium voltage-gated channel subfamily H member 2 (hERG) Voltage-gated potassium channel subunit Kv11.1 hERG Potassium Channel 1 | putative potassium channel subunit
Type:
Multi-pass membrane protein
Mol. Mass.:
126672.65
Organism:
Homo sapiens (Human)
Description:
Q12809
Residue:
1159
  
Inhibitor
Name:
BDBM50151863
Synonyms:
(R)-2-Methyl-3-phenethyl-5-phenyl-2,5-dihydro-1H-benzo[e][1,3]diazepine WIN-61773-2
Type:
Small organic molecule
Emp. Form.:
C24H24N2
Mol. Mass.:
340.4608
SMILES:
CN1Cc2ccccc2[C@H](N=C1CCc1ccccc1)c1ccccc1
: