Target
Potassium voltage-gated channel subfamily H member 2
Ligand
BDBM50151866
Substrate
Meas. Tech.
ChEMBL_304914 (CHEMBL827807)
IC50
10000±n/a nM
Citation
 Du, LPTsai, KCLi, MYYou, QDXia, L The pharmacophore hypotheses of I(Kr) potassium channel blockers: novel class III antiarrhythmic agents. Bioorg Med Chem Lett 14:4771-7 (2004)  
Target
Name:
Potassium voltage-gated channel subfamily H member 2
Synonyms:
1,3-beta-glucan synthase component GLS2 ERG Eag-related protein 1 Ether-a-go-go-related gene (HERG) Ether-a-go-go-related gene potassium channel 1 Ether-a-go-go-related gene potassium channel 1 (hERG1) Ether-a-go-go-related protein 1 H-ERG KCNH2 Potassium voltage-gated channel subfamily H member 2 (hERG) Voltage-gated potassium channel subunit Kv11.1 hERG Potassium Channel 1 | putative potassium channel subunit
Type:
Multi-pass membrane protein
Mol. Mass.:
126672.65
Organism:
Homo sapiens (Human)
Description:
Q12809
Residue:
1159
  
Inhibitor
Name:
BDBM50151866
Synonyms:
6-(2-{(2-Hydroxy-ethyl)-[3-(4-nitro-phenyl)-propyl]-amino}-ethylamino)-1,3-dimethyl-1H-pyrimidine-2,4-dione Nifekalant
Type:
Small organic molecule
Emp. Form.:
C19H27N5O5
Mol. Mass.:
405.4482
SMILES:
Cn1c(NCCN(CCO)CCCc2ccc(cc2)[N+]([O-])=O)cc(=O)n(C)c1=O
: