Target
Sphingosine 1-phosphate receptor 3
Ligand
BDBM50152322
Substrate
Meas. Tech.
ChEMBL_306055 (CHEMBL833011)
IC50
2.7±n/a nM
Citation
 Yan, LHale, JJLynch, CLBudhu, RGentry, AMills, SGHajdu, RKeohane, CARosenbach, MJMilligan, JAShei, GJChrebet, GBergstrom, JCard, DRosen, HMandala, SM Design and synthesis of conformationally constrained 3-(N-alkylamino)propylphosphonic acids as potent agonists of sphingosine-1-phosphate (S1P) receptors. Bioorg Med Chem Lett 14:4861-6 (2004)  
Target
Name:
Sphingosine 1-phosphate receptor 3
Synonyms:
C9orf108 EDG3 S1P receptor 3 S1P3 S1PR3_HUMAN Sphingosine 1-phosphate receptor 3 (S1P3) | Sphingosine 1-phosphate receptor Edg-3
Type:
G Protein-Coupled Receptor (GPCR)
Mol. Mass.:
42278.13
Organism:
Homo sapiens (Human)
Description:
Q99500
Residue:
378
  
Inhibitor
Name:
BDBM50152322
Synonyms:
CHEMBL184879 | {2-[5-(4-Nonyl-phenyl)-pyrrolidin-2-yl]-ethyl}-phosphonic acid
Type:
Small organic molecule
Emp. Form.:
C21H36NO3P
Mol. Mass.:
381.4892
SMILES:
CCCCCCCCCc1ccc(cc1)C1CCC(CCP(O)(O)=O)N1
: