Target
Delta-type opioid receptor
Ligand
BDBM50153122
Substrate
Meas. Tech.
ChEMBL_303251 (CHEMBL826377)
Ki
>2000±n/a nM
Citation
 Goehring, RRWhitehead, JFBrown, KIslam, KWen, XZhou, XChen, ZValenzano, KJMiller, WSShan, SKyle, DJ 1,3-Dihydro-2,1,3-benzothiadiazol-2,2-diones and 3,4-dihydro-1H-2,1,3-benzothidiazin-2,2-diones as ligands for the NOP receptor. Bioorg Med Chem Lett 14:5045-50 (2004)  
Target
Name:
Delta-type opioid receptor
Synonyms:
D-OR-1 Delta opioid receptor OPIATE Delta OPRD1 OPRK1 | opioid receptor, delta 1
Type:
G Protein-Coupled Receptor (GPCR)
Mol. Mass.:
40382.98
Organism:
Homo sapiens (Human)
Description:
Competition binding assays were carried out using membrane preparations from transfected HN9.10 cells that constitutively expressed the delta opioid receptor.
Residue:
372
  
Inhibitor
Name:
BDBM50153122
Synonyms:
CHEMBL181545 | {1-[1-(4-Isopropyl-cyclohexyl)-piperidin-4-yl]-2,2-dioxo-1,4-dihydro-2H-2lambda*6*-benzo[1,2,6]thiadiazin-3-yl}-acetic acid tert-butyl ester
Type:
Small organic molecule
Emp. Form.:
C27H43N3O4S
Mol. Mass.:
505.713
SMILES:
CC(C)C1CCC(CC1)N1CCC(CC1)N1c2ccccc2CN(CC(=O)OC(C)(C)C)S1(=O)=O
: