Target
Mu-type opioid receptor
Ligand
BDBM50153122
Substrate
Meas. Tech.
ChEMBL_303169 (CHEMBL829980)
Ki
289±n/a nM
Citation
 Goehring, RRWhitehead, JFBrown, KIslam, KWen, XZhou, XChen, ZValenzano, KJMiller, WSShan, SKyle, DJ 1,3-Dihydro-2,1,3-benzothiadiazol-2,2-diones and 3,4-dihydro-1H-2,1,3-benzothidiazin-2,2-diones as ligands for the NOP receptor. Bioorg Med Chem Lett 14:5045-50 (2004)  
Target
Name:
Mu-type opioid receptor
Synonyms:
M-OR-1 MOR-1 MUOR1 Mu opiate receptor OPRM1 hMOP | mu-type opioid receptor isoform MOR-1
Type:
G Protein-Coupled Receptor (GPCR)
Mol. Mass.:
44789.51
Organism:
Homo sapiens (Human)
Description:
P35372
Residue:
400
  
Inhibitor
Name:
BDBM50153122
Synonyms:
CHEMBL181545 | {1-[1-(4-Isopropyl-cyclohexyl)-piperidin-4-yl]-2,2-dioxo-1,4-dihydro-2H-2lambda*6*-benzo[1,2,6]thiadiazin-3-yl}-acetic acid tert-butyl ester
Type:
Small organic molecule
Emp. Form.:
C27H43N3O4S
Mol. Mass.:
505.713
SMILES:
CC(C)C1CCC(CC1)N1CCC(CC1)N1c2ccccc2CN(CC(=O)OC(C)(C)C)S1(=O)=O
: