Target
RNA-directed RNA polymerase
Ligand
BDBM50157169
Substrate
Meas. Tech.
ChEMBL_306368 (CHEMBL829165)
IC50
3100±n/a nM
Citation
 Shipps, GWDeng, YWang, TPopovici-Muller, JCurran, PJRosner, KECooper, ABGirijavallabhan, VButkiewicz, NCable, M Aminothiazole inhibitors of HCV RNA polymerase. Bioorg Med Chem Lett 15:115-9 (2004)  
Target
Name:
RNA-directed RNA polymerase
Synonyms:
Hepatitis C virus NS5B RNA-dependent RNA polymerase | NS5B protein
Type:
Protein
Mol. Mass.:
25173.95
Organism:
Hepatitis C virus
Description:
Q8JXU8
Residue:
229
  
Inhibitor
Name:
BDBM50157169
Synonyms:
2-{Cyclohexyl-[4-(3-methoxy-phenoxy)-benzoyl]-amino}-thiazole-5-carboxylic acid | CHEMBL182462
Type:
Small organic molecule
Emp. Form.:
C24H24N2O5S
Mol. Mass.:
452.523
SMILES:
COc1cccc(Oc2ccc(cc2)C(=O)N(C2CCCCC2)c2ncc(s2)C(O)=O)c1
: