Target
RNA-directed RNA polymerase
Ligand
BDBM50157178
Substrate
Meas. Tech.
ChEMBL_306368 (CHEMBL829165)
IC50
4700±n/a nM
Citation
 Shipps, GWDeng, YWang, TPopovici-Muller, JCurran, PJRosner, KECooper, ABGirijavallabhan, VButkiewicz, NCable, M Aminothiazole inhibitors of HCV RNA polymerase. Bioorg Med Chem Lett 15:115-9 (2004)  
Target
Name:
RNA-directed RNA polymerase
Synonyms:
Hepatitis C virus NS5B RNA-dependent RNA polymerase | NS5B protein
Type:
Protein
Mol. Mass.:
25173.95
Organism:
Hepatitis C virus
Description:
Q8JXU8
Residue:
229
  
Inhibitor
Name:
BDBM50157178
Synonyms:
2-[(R)-(4-tert-Butyl-cyclohexyl)-(4-phenoxy-benzoyl)-amino]-thiazole-4-carboxylic acid
Type:
Small organic molecule
Emp. Form.:
C27H30N2O4S
Mol. Mass.:
478.603
SMILES:
CC(C)(C)[C@H]1CCC(CC1)N(C(=O)c1ccc(Oc2ccccc2)cc1)c1nc(cs1)C(O)=O
: