Target
RNA-directed RNA polymerase
Ligand
BDBM50157195
Substrate
Meas. Tech.
ChEMBL_306368 (CHEMBL829165)
IC50
6500±n/a nM
Citation
 Shipps, GWDeng, YWang, TPopovici-Muller, JCurran, PJRosner, KECooper, ABGirijavallabhan, VButkiewicz, NCable, M Aminothiazole inhibitors of HCV RNA polymerase. Bioorg Med Chem Lett 15:115-9 (2004)  
Target
Name:
RNA-directed RNA polymerase
Synonyms:
Hepatitis C virus NS5B RNA-dependent RNA polymerase | NS5B protein
Type:
Protein
Mol. Mass.:
25173.95
Organism:
Hepatitis C virus
Description:
Q8JXU8
Residue:
229
  
Inhibitor
Name:
BDBM50157195
Synonyms:
2-{Cyclohexyl-[4-(3-fluoro-benzyloxy)-benzoyl]-amino}-thiazole-5-carboxylic acid | CHEMBL180551
Type:
Small organic molecule
Emp. Form.:
C24H23FN2O4S
Mol. Mass.:
454.514
SMILES:
OC(=O)c1cnc(s1)N(C1CCCCC1)C(=O)c1ccc(OCc2cccc(F)c2)cc1
: