Target
RNA-directed RNA polymerase
Ligand
BDBM50157201
Substrate
Meas. Tech.
ChEMBL_306368 (CHEMBL829165)
IC50
5100±n/a nM
Citation
 Shipps, GWDeng, YWang, TPopovici-Muller, JCurran, PJRosner, KECooper, ABGirijavallabhan, VButkiewicz, NCable, M Aminothiazole inhibitors of HCV RNA polymerase. Bioorg Med Chem Lett 15:115-9 (2004)  
Target
Name:
RNA-directed RNA polymerase
Synonyms:
Hepatitis C virus NS5B RNA-dependent RNA polymerase | NS5B protein
Type:
Protein
Mol. Mass.:
25173.95
Organism:
Hepatitis C virus
Description:
Q8JXU8
Residue:
229
  
Inhibitor
Name:
BDBM50157201
Synonyms:
2-{Cyclohexyl-[4-(2-trifluoromethyl-benzyloxy)-benzoyl]-amino}-thiazole-5-carboxylic acid | CHEMBL368217
Type:
Small organic molecule
Emp. Form.:
C25H23F3N2O4S
Mol. Mass.:
504.521
SMILES:
OC(=O)c1cnc(s1)N(C1CCCCC1)C(=O)c1ccc(OCc2ccccc2C(F)(F)F)cc1
: