Target
Prothrombin
Ligand
BDBM50292203
Substrate
Meas. Tech.
ChEMBL_302401 (CHEMBL829646)
Ki
0.002±n/a nM
Citation
 Nantermet, PGBurgey, CSRobinson, KAPellicore, JMNewton, CLDeng, JZSelnick, HGLewis, SDLucas, BJKrueger, JAMiller-Stein, CWhite, RBWong, BMcMasters, DRWallace, AALynch, JJYan, YChen, ZKuo, LGardell, SJShafer, JAVacca, JPLyle, TA P2 pyridine N-oxide thrombin inhibitors: a novel peptidomimetic scaffold. Bioorg Med Chem Lett 15:2771-5 (2005)  
Target
Name:
Prothrombin
Synonyms:
Activation peptide fragment 1 Coagulation factor II Prothrombin precursor Thrombin heavy chain | Thrombin light chain
Type:
Protein
Mol. Mass.:
70029.57
Organism:
Homo sapiens (Human)
Description:
P00734
Residue:
622
  
Inhibitor
Name:
BDBM50292203
Synonyms:
CHEMBL196030 | N-(5-Chloro-2-tetrazol-1-yl-benzyl)-2-[3-cyano-6-(2,2-difluoro-2-pyridin-2-yl-ethylamino)-1-oxy-pyridin-2-yl]-acetamide
Type:
Small organic molecule
Emp. Form.:
C23H20ClF2N9O2
Mol. Mass.:
527.914
SMILES:
ON1C(CCC(C#N)=C1CC(=O)NCc1cc(Cl)ccc1-n1cnnn1)=NCC(F)(F)c1ccccn1
: