Target
5-hydroxytryptamine receptor 3A/3B
Ligand
BDBM50166983
Substrate
Meas. Tech.
ChEMBL_303681 (CHEMBL830441)
Ki
4.2±n/a nM
Citation
 Cappelli, AGallelli, AManini, MAnzini, MMennuni, LMakovec, FMenziani, MCAlcaro, SOrtuso, FVomero, S Further studies on the interaction of the 5-hydroxytryptamine3 (5-HT3) receptor with arylpiperazine ligands. development of a new 5-HT3 receptor ligand showing potent acetylcholinesterase inhibitory properties. J Med Chem 48:3564-75 (2005)  
Target
Name:
5-hydroxytryptamine receptor 3A/3B
Synonyms:
Serotonin 3 (5-HT3) receptor | Serotonin 3a (5-HT3a)/3b (5-HT3b) receptor
Type:
Mol. Mass.:
Description:
ASSAY_ID of EBI is 2974
Components:
This complex has 2 components.
Component 1
Name:
5-hydroxytryptamine receptor 3B
Synonyms:
5HT3B_RAT Serotonin (5-HT) receptor
Type:
PROTEIN
Mol. Mass.:
50328.78
Organism:
Rattus norvegicus
Description:
EBI_11885
Residue:
437
  
Component 2
Name:
5-hydroxytryptamine receptor 3A
Synonyms:
5-HT3 5HT3A_RAT Htr3 Serotonin (5-HT) receptor | Zacopride site-R
Type:
Enzyme Catalytic Domain
Mol. Mass.:
55428.70
Organism:
RAT
Description:
5-HT3 HTR3A RAT::P35563
Residue:
483
  
Inhibitor
Name:
BDBM50166983
Synonyms:
2-sec-Butyl-4-(4-methyl-piperazin-1-yl)-2,3-dihydro-pyrrolo[3,4-c]quinolin-1-one | CHEMBL364957
Type:
Small organic molecule
Emp. Form.:
C20H26N4O
Mol. Mass.:
338.4466
SMILES:
CCC(C)N1Cc2c(C1=O)c1ccccc1nc2N1CCN(C)CC1
: