Target
Acetylcholinesterase
Ligand
BDBM50167003
Substrate
Meas. Tech.
ChEMBL_305078 (CHEMBL832709)
IC50
>10000±n/a nM
Citation
 Cappelli, AGallelli, AManini, MAnzini, MMennuni, LMakovec, FMenziani, MCAlcaro, SOrtuso, FVomero, S Further studies on the interaction of the 5-hydroxytryptamine3 (5-HT3) receptor with arylpiperazine ligands. development of a new 5-HT3 receptor ligand showing potent acetylcholinesterase inhibitory properties. J Med Chem 48:3564-75 (2005)  
Target
Name:
Acetylcholinesterase
Synonyms:
ACES_HUMAN Acetylcholinesterase (AChE) | Acetylcholinesterase (human AChE)
Type:
Enzyme
Mol. Mass.:
67792.70
Organism:
Homo sapiens (Human)
Description:
P22303
Residue:
614
  
Inhibitor
Name:
BDBM50167003
Synonyms:
3-Methyl-2-(4-methyl-piperazin-1-yl)-quinoline-4-carboxylic acid ethyl ester | CHEMBL372262
Type:
Small organic molecule
Emp. Form.:
C18H23N3O2
Mol. Mass.:
313.3941
SMILES:
CCOC(=O)c1c(C)c(nc2ccccc12)N1CCN(C)CC1
: