Target
Solute carrier family 15 member 1
Ligand
BDBM50350483
Substrate
Meas. Tech.
ChEMBL_302952 (CHEMBL841787)
Ki
12000000±n/a nM
Citation
 Biegel, AGebauer, SHartrodt, BBrandsch, MNeubert, KThondorf, I Three-dimensional quantitative structure-activity relationship analyses of beta-lactam antibiotics and tripeptides as substrates of the mammalian H+/peptide cotransporter PEPT1. J Med Chem 48:4410-9 (2005)  
Target
Name:
Solute carrier family 15 member 1
Synonyms:
Intestinal H(+)/peptide cotransporter Oligopeptide transporter, small intestine isoform Peptide transporter 1 SLC15A1
Type:
PROTEIN
Mol. Mass.:
78818.07
Organism:
Homo sapiens (Human)
Description:
ChEMBL_1488839
Residue:
708
  
Inhibitor
Name:
BDBM50350483
Synonyms:
Bactocill | OXACILLIN
Type:
Small organic molecule
Emp. Form.:
C19H19N3O5S
Mol. Mass.:
401.436
SMILES:
Cc1onc(c1C(=O)N[C@H]1[C@H]2SC(C)(C)[C@@H](N2C1=O)C(O)=O)-c1ccccc1
: