Target
S-methyl-5'-thioadenosine phosphorylase
Ligand
BDBM50170084
Substrate
Meas. Tech.
ChEMBL_303908 (CHEMBL828333)
Ki
3±n/a nM
Citation
 Evans, GBFurneaux, RHLenz, DHPainter, GFSchramm, VLSingh, VTyler, PC Second generation transition state analogue inhibitors of human 5'-methylthioadenosine phosphorylase. J Med Chem 48:4679-89 (2005)  
Target
Name:
S-methyl-5'-thioadenosine phosphorylase
Synonyms:
5'-Methylthioadenosine phosphorylase (MTAP) MTA phosphorylase MTAP_HUMAN Methylthioadenosine Phosphorylase (MTAP) | S-methyl-5 -thioadenosine phosphorylase
Type:
Enzyme
Mol. Mass.:
31239.23
Organism:
Homo sapiens (Human)
Description:
Residue:
283
  
Inhibitor
Name:
BDBM50170084
Synonyms:
1-(4-Amino-4,5-dihydro-3H-pyrrolo[3,2-d]pyrimidin-7-ylmethyl)-4-propyl-pyrrolidin-3-ol | CHEMBL189911
Type:
Small organic molecule
Emp. Form.:
C14H23N5O
Mol. Mass.:
277.3653
SMILES:
CCCC1CN(Cc2c[nH]c3C(N)NC=Nc23)CC1O
: