Target
S-methyl-5'-thioadenosine phosphorylase
Ligand
BDBM50170082
Substrate
Meas. Tech.
ChEMBL_303908 (CHEMBL828333)
Ki
0.034±n/a nM
Citation
 Evans, GBFurneaux, RHLenz, DHPainter, GFSchramm, VLSingh, VTyler, PC Second generation transition state analogue inhibitors of human 5'-methylthioadenosine phosphorylase. J Med Chem 48:4679-89 (2005)  
Target
Name:
S-methyl-5'-thioadenosine phosphorylase
Synonyms:
5'-Methylthioadenosine phosphorylase (MTAP) MTA phosphorylase MTAP_HUMAN Methylthioadenosine Phosphorylase (MTAP) | S-methyl-5 -thioadenosine phosphorylase
Type:
Enzyme
Mol. Mass.:
31239.23
Organism:
Homo sapiens (Human)
Description:
Residue:
283
  
Inhibitor
Name:
BDBM50170082
Synonyms:
1-(4-Amino-4,5-dihydro-3H-pyrrolo[3,2-d]pyrimidin-7-ylmethyl)-4-ethylsulfanylmethyl-pyrrolidin-3-ol | CHEMBL191544
Type:
Small organic molecule
Emp. Form.:
C14H23N5OS
Mol. Mass.:
309.43
SMILES:
CCSCC1CN(Cc2c[nH]c3C(N)NC=Nc23)CC1O
: