Target
5-hydroxytryptamine receptor 2C
Ligand
BDBM50159175
Substrate
Meas. Tech.
ChEMBL_303673 (CHEMBL877457)
Ki
566±n/a nM
Citation
 Cole, DCLennox, WJLombardi, SEllingboe, JWBernotas, RCTawa, GJMazandarani, HSmith, DLZhang, GCoupet, JSchechter, LE Discovery of 5-arylsulfonamido-3-(pyrrolidin-2-ylmethyl)-1H-indole derivatives as potent, selective 5-HT6 receptor agonists and antagonists. J Med Chem 48:353-6 (2005)  
Target
Name:
5-hydroxytryptamine receptor 2C
Synonyms:
5-HT-2C 5-HT2C-INI 5-HTR2C 5-hydroxytryptamine receptor 2C (5-HT-2C) 5HT-1C HTR1C Serotonin (5-HT3) receptor Serotonin Receptor 2C
Type:
G Protein-Coupled Receptor (GPCR)
Mol. Mass.:
51836.79
Organism:
Homo sapiens (Human)
Description:
P28335
Residue:
458
  
Inhibitor
Name:
BDBM50159175
Synonyms:
2-Chloro-N-(3-(R)-1-pyrrolidin-2-ylmethyl-1H-indol-5-yl)-benzenesulfonamide
Type:
Small organic molecule
Emp. Form.:
C19H20ClN3O2S
Mol. Mass.:
389.899
SMILES:
Clc1ccccc1S(=O)(=O)Nc1ccc2[nH]cc(CC3CCCN3)c2c1
: